Butanedioic acid, 2-hydroxy-2-(1-methylethyl), dimethyl ester
- Formula: C9H16O5
- Molecular weight: 204.2203
- IUPAC Standard InChIKey: OQIDMHZJNDYZLB-UHFFFAOYSA-N
- CAS Registry Number: 43064-52-4
- Chemical structure:
View 3d structure (requires JavaScript / HTML 5) - Other names: 2-Hydroxy-2-isopropyl-succinic acid dimethyl ester; dimethyl 2-hydroxy-2-(isopropyl)succinate

Normal alkane RI, non-polar column, temperature ramp

Column type | Active phase | I | Reference | Comment |
---|---|---|---|---|
Capillary | OV-101 | 1247. | Pinkston, Spiteller, et al., 1981 | H2, 80. C @ 7. min, 2. K/min; Column length: 30. m; Column diameter: 0.3 mm; Tend: 275. C |
Capillary | OV-101 | 1247. | Spiteller and Spiteller, 1979 | He, 75. C @ 7. min, 2. K/min; Column length: 25. m; Tend: 280. C |

References

Pinkston, Spiteller, et al., 1981
Pinkston, D.; Spiteller, G.; von Henning, H.; Matthaei, D.,
High-resolution gas chromatography-mass spectrometry of the methyl esters of organic acids from uremic hemofiltrates,
J. Chromatogr., 1981, 223, 1, 1-19, https://doi.org/10.1016/S0378-4347(00)80063-8
. [all data]
Spiteller and Spiteller, 1979
Spiteller, M.; Spiteller, G.,
Trennung und charakterisierung saurer harnbest and- teile,
J. Chromatogr., 1979, 164, 3, 253-317, https://doi.org/10.1016/S0378-4347(00)81232-3
. [all data]