Ethane, 1,2-dichloro-1-fluoro-
- Formula: C2H3Cl2F
- Molecular weight: 116.950
- IUPAC Standard InChIKey: NDKGUMMLYBINOC-UHFFFAOYSA-N
- CAS Registry Number: 430-57-9
- Chemical structure:
View 3d structure (requires JavaScript / HTML 5) - Other names: Freon 141; 1,2-Dichloro-1-fluoroethane; 1,2-Dichlorofluoroethane; 1-Fluoro-1,2-dichloro-ethane; Freon 141a

Phase change data

Data compiled as indicated in comments:
BS - Robert L. Brown and Stephen E. Stein
TRC - Thermodynamics Research Center, NIST Boulder Laboratories, Chris Muzny director
Quantity | Value | Units | Method | Reference | Comment |
---|---|---|---|---|---|
Tboil | 349. | K | N/A | PCR Inc., 1990 | BS |
Tboil | 346.95 | K | N/A | Henne and Renoll, 1936 | Uncertainty assigned by TRC = 0.5 K; TRC |

References

PCR Inc., 1990
PCR Inc.,
Research Chemicals Catalog 1990-1991, PCR Inc., Gainesville, FL, 1990, 1. [all data]
Henne and Renoll, 1936
Henne, A.L.; Renoll, M.W.,
J. Am. Chem. Soc., 1936, 58, 889. [all data]