1,1,1-Triphenylbutane
- Formula: C22H22
- Molecular weight: 286.4101
- IUPAC Standard InChIKey: BQULNJDDNPKMKQ-UHFFFAOYSA-N
- CAS Registry Number: 43044-69-5
- Chemical structure:
View 3d structure (requires JavaScript / HTML 5) - Permanent link for this species. Use this link for bookmarking this species for future reference.

Phase change data

Data compiled by: William E. Acree, Jr., James S. Chickos
Quantity | Value | Units | Method | Reference | Comment |
---|---|---|---|---|---|
ΔsubH° | 114.3 ± 1.1 | kJ/mol | GS | Verevkin, 1999 | Based on data from 323. to 347. K. |
Enthalpy of sublimation
ΔsubH (kJ/mol) | Temperature (K) | Method | Reference | Comment |
---|---|---|---|---|
112.1 ± 1.1 | 335. | GS | Verevkin, 1999 | Based on data from 323. to 347. K. |
Enthalpy of fusion
ΔfusH (kJ/mol) | Temperature (K) | Method | Reference |
---|---|---|---|
21.84 | 351.1 | DSC | Verevkin, 1999 |

References

Verevkin, 1999
Verevkin, Sergey P.,
Thermochemical Properties of Triphenylalkanes and Tetraphenylmethane. Strain in Phenyl Substituted Alkanes,
J. Chem. Eng. Data, 1999, 44, 3, 557-562, https://doi.org/10.1021/je9802726
. [all data]