(E)-9-octadecenamide
- Formula: C18H35NO
- Molecular weight: 281.4766
- IUPAC Standard InChIKey: FATBGEAMYMYZAF-MDZDMXLPSA-N
- CAS Registry Number: 4303-70-2
- Chemical structure:
View 3d structure (requires JavaScript / HTML 5) - Species with the same structure:
- Stereoisomers:
- Other names: elaidamide

Phase change data

Data compiled by: Thermodynamics Research Center, NIST Boulder Laboratories, Chris Muzny director
Quantity | Value | Units | Method | Reference | Comment |
---|---|---|---|---|---|
Tfus | 364.95 | K | N/A | Mod, Magne, et al., 1960 | Uncertainty assigned by TRC = 0.3 K |

References

Mod, Magne, et al., 1960
Mod, R.R.; Magne, F.C.; Skau, E.L.,
Pure Acid-Free Amides of C18 Fatty Acids. Their Preparation and Binary Freezing Point Behavior,
J. Chem. Eng. Data, 1960, 5, 478. [all data]