N,N'-(Di-3,4-dichlorophenyl)urea
- Formula: C13H8Cl4N2O
- Molecular weight: 350.027
- IUPAC Standard InChIKey: ZDPIZPXVHVYTOK-UHFFFAOYSA-N
- CAS Registry Number: 4300-43-0
- Chemical structure:
View 3d structure (requires JavaScript / HTML 5) - Permanent link for this species. Use this link for bookmarking this species for future reference.

Reaction thermochemistry data

Data compiled by: Hussein Y. Afeefy, Joel F. Liebman, and Stephen E. Stein
Individual Reactions
By formula: C13H8Cl4N2O = C7H3Cl2NO + C6H5Cl2N
Quantity | Value | Units | Method | Reference | Comment |
---|---|---|---|---|---|
ΔrH° | 102.1 ± 5.6 | kJ/mol | Eqk | Chimishkyan, Svetlova, et al., 1984 | solid phase; Dissociation |

References

Chimishkyan, Svetlova, et al., 1984
Chimishkyan, A.L.; Svetlova, L.P.; Leonova, T.V.; Gluyaev, N.D.,
Thermal decomposition of substituted ureas,
J. Gen. Chem. USSR, 1984, 54, 1317-1320. [all data]