2,2-Dimethyl-3-tert-butyl-3-heptanol
- Formula: C13H28O
- Molecular weight: 200.3608
- IUPAC Standard InChIKey: HJQVCOWLDOUINN-UHFFFAOYSA-N
- CAS Registry Number: 42930-67-6
- Chemical structure:
View 3d structure (requires JavaScript / HTML 5) - Permanent link for this species. Use this link for bookmarking this species for future reference.

Phase change data

Data compiled by: William E. Acree, Jr., James S. Chickos
Enthalpy of vaporization
ΔvapH (kJ/mol) | Temperature (K) | Reference | Comment |
---|---|---|---|
58.3 | 394. | Wilhoit and Zwolinski, 1973 | Based on data from 379. to 513. K. |

References

Wilhoit and Zwolinski, 1973
Wilhoit, R.C.; Zwolinski, B.J.,
Physical and thermodynamic properties of aliphatic alcohols,
J. Phys. Chem. Ref. Data Suppl., 1973, 1, 2, 1. [all data]