1-Isopropylcyclohex-1-ene
- Formula: C9H16
- Molecular weight: 124.2233
- IUPAC Standard InChIKey: ZYMCVIZKLGUPBG-UHFFFAOYSA-N
- CAS Registry Number: 4292-04-0
- Chemical structure:
View 3d structure (requires JavaScript / HTML 5) - Other names: Cyclohexene, 1-(1-methylethyl); 1-Isopropylcyclohexene-1; 1-isopropylcyclohexene

Phase change data

Data compiled by: Thermodynamics Research Center, NIST Boulder Laboratories, Chris Muzny director
Quantity | Value | Units | Method | Reference | Comment |
---|---|---|---|---|---|
Tboil | 426.3 | K | N/A | Signaigo and Cramer, 1933 | Uncertainty assigned by TRC = 4. K |
Tboil | 429. | K | N/A | Wallach and Mallison, 1908 | Uncertainty assigned by TRC = 5. K |

Reaction thermochemistry data

Data compiled by: Hussein Y. Afeefy, Joel F. Liebman, and Stephen E. Stein
Individual Reactions
By formula: C9H16 = C9H16
Quantity | Value | Units | Method | Reference | Comment |
---|---|---|---|---|---|
ΔrH° | -3.1 ± 0.63 | kJ/mol | Kin | Bigley and May, 1970 | liquid phase; solvent: Acetic acid |

Kovats' RI, non-polar column, isothermal

Column type | Active phase | Temperature (C) | I | Reference | Comment |
---|---|---|---|---|---|
Capillary | SE-30 | 80. | 922.8 | Albaigés and Guardino, 1980 | He; Column length: 64. m; Column diameter: 0.25 mm |
Capillary | Squalane | 80. | 919.4 | Albaigés and Guardino, 1980 | He; Column length: 100. m; Column diameter: 0.25 mm |
Packed | Squalane | 80. | 929. | Bogoslovsky, Anvaer, et al., 1978 | |
Capillary | Squalane | 100. | 933. | Rang, Orav, et al., 1977 | Nitrogen or helium; Column length: 100. m; Column diameter: 0.25 mm |
Capillary | Apiezon L | 100. | 962. | Eisen, Orav, et al., 1972 | Column length: 45. m; Column diameter: 0.25 mm |
Capillary | Apiezon L | 120. | 972. | Eisen, Orav, et al., 1972 | Column length: 45. m; Column diameter: 0.25 mm |
Capillary | Squalane | 60. | 922.2 | Eisen, Orav, et al., 1972 | Column length: 80. m; Column diameter: 0.25 mm |
Capillary | Squalane | 80. | 928.8 | Eisen, Orav, et al., 1972 | Column length: 80. m; Column diameter: 0.25 mm |

Kovats' RI, polar column, isothermal

Column type | Active phase | Temperature (C) | I | Reference | Comment |
---|---|---|---|---|---|
Capillary | PEG-20M | 80. | 1038. | Rang, Orav, et al., 1988 | |
Capillary | PEG 4000 | 100. | 1064. | Rang, Orav, et al., 1988 | |
Capillary | PEG 4000 | 110. | 1073. | Rang, Orav, et al., 1988 | |
Capillary | PEG 4000 | 60. | 1045. | Rang, Orav, et al., 1988 | |
Capillary | PEG 4000 | 80. | 1055. | Rang, Orav, et al., 1988 | |
Capillary | PEG 4000 | 100. | 1064. | Rang, Orav, et al., 1977 | Nitrogen or Helium; Column length: 45. m; Column diameter: 0.25 mm |
Capillary | Polyethylene Glycol 4000 | 100. | 1082.3 | Eisen, Orav, et al., 1972 | Column length: 80. m; Column diameter: 0.25 mm |
Capillary | Polyethylene Glycol 4000 | 60. | 1058.1 | Eisen, Orav, et al., 1972 | Column length: 80. m; Column diameter: 0.25 mm |
Capillary | Polyethylene Glycol 4000 | 80. | 1069.8 | Eisen, Orav, et al., 1972 | Column length: 80. m; Column diameter: 0.25 mm |

Van Den Dool and Kratz RI, non-polar column, temperature ramp

Column type | Active phase | I | Reference | Comment |
---|---|---|---|---|
Capillary | Petrocol DH | 924. | White, Hackett, et al., 1992 | 100. m/0.25 mm/0.5 μm, He, 1. K/min; Tstart: 30. C; Tend: 220. C |

References

Signaigo and Cramer, 1933
Signaigo, F.K.; Cramer, P.L.,
The preparation of some mono- and dialkylcylohexanes,
J. Am. Chem. Soc., 1933, 55, 3326-32. [all data]
Wallach and Mallison, 1908
Wallach, O.; Mallison, H.,
Knowledge of Terpenes and Essential Oils. VII. Condensation of Cyclohexanone with Bromobutyric Acid Ester,
Justus Liebigs Ann. Chem., 1908, 360, 68-70. [all data]
Bigley and May, 1970
Bigley, D.B.; May, R.W.,
The kinetics of acid-catalysed equilibrations of endo- and exo-cyclic olefins,
J. Chem. Soc. B, 1970, 1761-1766. [all data]
Albaigés and Guardino, 1980
Albaigés, J.; Guardino, X.,
Gas chromatographic-mass spectrometric identification of alkylcyclohexanes and cyclohexenes,
Chromatographia, 1980, 13, 12, 755-762, https://doi.org/10.1007/BF02265555
. [all data]
Bogoslovsky, Anvaer, et al., 1978
Bogoslovsky, Yu.N.; Anvaer, B.I.; Vigdergauz, M.S.,
Chromatographic constants in gas chromatography (in Russian), Standards Publ. House, Moscow, 1978, 192. [all data]
Rang, Orav, et al., 1977
Rang, S.; Orav, A.; Kuningas, K.; Eisen, O.,
Capillary Gas Chromatography of Monosubstituted Cyclopentenes and Cyclohexenes,
Chromatographia, 1977, 10, 3, 115-122, https://doi.org/10.1007/BF02297862
. [all data]
Eisen, Orav, et al., 1972
Eisen, O.; Orav, A.; Rang, S.,
Identifizierung von Normal-Alkenen, Cyclopentenen und -Hexenen mittels Kapillar-Gas-Chromatographie. Identification des alcènes, cyclopentènes et -hexènes à l'aide de la chromatogrpahie en phase gazeuse sur colonne capillaire,
Chromatographia, 1972, 5, 11, 229-239, https://doi.org/10.1007/BF02270600
. [all data]
Rang, Orav, et al., 1988
Rang, S.A.; Orav, A.E.; Kuningas, K.R.; Meister, A.E.; Strense, T.V.; Eisen, O.G.,
Gas-Chromatographic Characteristics of unsaturated hydrocarbons, Academy of Sciences of Estonia SSR, Tallinn, Estonia SSR, 1988, 208. [all data]
White, Hackett, et al., 1992
White, C.M.; Hackett, J.; Anderson, R.R.; Kail, S.; Spock, P.S.,
Linear temperature programmed retention indices of gasoline range hydrocarbons and chlorinated hydrocarbons on cross-linked polydimethylsiloxane,
J. Hi. Res. Chromatogr., 1992, 15, 2, 105-120, https://doi.org/10.1002/jhrc.1240150211
. [all data]