Nonane, 1-iodo-
- Formula: C9H19I
- Molecular weight: 254.1516
- IUPAC Standard InChIKey: OGSJMFCWOUHXHN-UHFFFAOYSA-N
- CAS Registry Number: 4282-42-2
- Chemical structure:
View 3d structure (requires JavaScript / HTML 5) - Other names: n-Nonyl iodide; Nonyl iodide; 1-n-Nonyl iodide; 1-Iodononane

Phase change data

Data compiled as indicated in comments:
BS - Robert L. Brown and Stephen E. Stein
AC - William E. Acree, Jr., James S. Chickos
Quantity | Value | Units | Method | Reference | Comment |
---|---|---|---|---|---|
ΔvapH° | 64.5 | kJ/mol | N/A | Bolotnikov and Neruchev, 2006 | See also Li and Rossini, 1961.; AC |
Reduced pressure boiling point
Tboil (K) | Pressure (bar) | Reference | Comment |
---|---|---|---|
380.7 | 0.01 | Aldrich Chemical Company Inc., 1990 | BS |
Enthalpy of vaporization
ΔvapH (kJ/mol) | Temperature (K) | Method | Reference | Comment |
---|---|---|---|---|
54.6 | 406. | N/A | Dykyj, Svoboda, et al., 1999 | Based on data from 391. to 551. K.; AC |
53.5 | 423. | A | Stephenson and Malanowski, 1987 | Based on data from 408. to 577. K. See also Dykyj and Vanko, 1970.; AC |
64.3 | 358. | N/A | Stull, 1947 | Based on data from 343. to 493. K.; AC |

References

Bolotnikov and Neruchev, 2006
Bolotnikov, Mikhail F.; Neruchev, Yurij A.,
Enthalpies of vaporization of a series of the 1-iodoalkanes,
Fluid Phase Equilibria, 2006, 243, 1-2, 121-125, https://doi.org/10.1016/j.fluid.2006.02.006
. [all data]
Li and Rossini, 1961
Li, J.C.M.; Rossini, F.D.,
Vapor Pressures and Boiling Points of the l-Fluoroalkanes, l-Chloroalkanes, l-Bromoalkanes, and l-Iodoalkanes, C 1 to C 20 .,
J. Chem. Eng. Data, 1961, 6, 2, 268-270, https://doi.org/10.1021/je60010a025
. [all data]
Aldrich Chemical Company Inc., 1990
Aldrich Chemical Company Inc.,
Catalog Handbook of Fine Chemicals, Aldrich Chemical Company, Inc., Milwaukee WI, 1990, 1. [all data]
Dykyj, Svoboda, et al., 1999
Dykyj, J.; Svoboda, J.; Wilhoit, R.C.; Frenkel, M.L.; Hall, K.R.,
Vapor Pressure of Chemicals: Part A. Vapor Pressure and Antoine Constants for Hydrocarbons and Sulfur, Selenium, Tellurium and Hydrogen Containing Organic Compounds, Springer, Berlin, 1999, 373. [all data]
Stephenson and Malanowski, 1987
Stephenson, Richard M.; Malanowski, Stanislaw,
Handbook of the Thermodynamics of Organic Compounds, 1987, https://doi.org/10.1007/978-94-009-3173-2
. [all data]
Dykyj and Vanko, 1970
Dykyj, J.; Vanko, A.,
Petrochemica, 1970, 10, 1, 3. [all data]
Stull, 1947
Stull, Daniel R.,
Vapor Pressure of Pure Substances. Organic and Inorganic Compounds,
Ind. Eng. Chem., 1947, 39, 4, 517-540, https://doi.org/10.1021/ie50448a022
. [all data]