2H-1-Benzopyran-2-one, 6,7-dimethoxy-4-methyl-

Normal alkane RI, non-polar column, temperature ramp

Data compiled by: NIST Mass Spectrometry Data Center, William E. Wallace, director

Column type Capillary
Active phase DB-5
Column length (m)
Carrier gas Argon
Substrate
Column diameter (mm)
Phase thickness (μm)
Tstart (C) 160.
Tend (C) 260.
Heat rate (K/min) 3.
Initial hold (min)
Final hold (min)
I 2166.
ReferenceOrlita, Sidwa-Gorycka, et al., 2008
Comment MSDC-RI

References

Orlita, Sidwa-Gorycka, et al., 2008
Orlita, A.; Sidwa-Gorycka, M.; Kumirska, J.; Malinski, E.; Siedlecka, E.M.; Gajdus, J.; Lojkowska, E.; Stepnowski, P., Identification of Ruta graveolens L. metabolites accumulated in the presence of abiotic elicitors, Biotechnol. Prog., 2008, 24, 1, 128-133, https://doi.org/10.1021/bp070261d . [all data]