Butane, 2,2-dichloro-
- Formula: C4H8Cl2
- Molecular weight: 127.012
- IUPAC Standard InChIKey: BSRTYNDWQXVCKR-UHFFFAOYSA-N
- CAS Registry Number: 4279-22-5
- Chemical structure:
View 3d structure (requires JavaScript / HTML 5) - Other names: 2,2-Dichlorobutane

Phase change data

Data compiled as indicated in comments:
BS - Robert L. Brown and Stephen E. Stein
TRC - Thermodynamics Research Center, NIST Boulder Laboratories, Chris Muzny director
AC - William E. Acree, Jr., James S. Chickos
Quantity | Value | Units | Method | Reference | Comment |
---|---|---|---|---|---|
Tboil | 377.2 | K | N/A | Weast and Grasselli, 1989 | BS |
Tboil | 374. | K | N/A | Anonymous, 1966 | Uncertainty assigned by TRC = 4. K; TRC |
Tboil | 376.15 | K | N/A | Rust and Vaughan, 1941 | Uncertainty assigned by TRC = 0.5 K; TRC |
Tboil | 376. | K | N/A | Tishchenko and Churbakov, 1937 | Uncertainty assigned by TRC = 4. K; TRC |
Quantity | Value | Units | Method | Reference | Comment |
ΔvapH° | 36.3 ± 0.1 | kJ/mol | C | He, An, et al., 1992 | AC |
ΔvapH° | 36.7 | kJ/mol | N/A | Basarová and Svoboda, 1991 | Based on data from 300. to 370. K.; AC |
ΔvapH° | 33.7 ± 0.6 | kJ/mol | EB | Pisarev, Rozhnov, et al., 1977 | AC |
Enthalpy of vaporization
ΔvapH (kJ/mol) | Temperature (K) | Method | Reference | Comment |
---|---|---|---|---|
36.4 | 308. | A | Stephenson and Malanowski, 1987 | Based on data from 293. to 376. K.; AC |

Reaction thermochemistry data

Data compiled by: Hussein Y. Afeefy, Joel F. Liebman, and Stephen E. Stein
Individual Reactions
By formula: C4H8Cl2 = C4H7Cl + HCl
Quantity | Value | Units | Method | Reference | Comment |
---|---|---|---|---|---|
ΔrH° | -8.79 ± 0.08 | kJ/mol | Eqk | Levanova, Rozhnov, et al., 1972 | gas phase; At 568 K |
ΔrH° | 55.2 ± 0.3 | kJ/mol | Eqk | Levanova, Rozhnov, et al., 1972 | gas phase; At 404.5 K |
By formula: C4H8Cl2 = C4H7Cl + HCl
Quantity | Value | Units | Method | Reference | Comment |
---|---|---|---|---|---|
ΔrH° | -14. ± 0.08 | kJ/mol | Eqk | Levanova, Rozhnov, et al., 1972 | gas phase; At 568 K |
ΔrH° | 5.0 ± 0.3 | kJ/mol | Eqk | Levanova, Rozhnov, et al., 1972 | gas phase; At 404.5 K |
By formula: C4H8Cl2 = C4H8Cl2
Quantity | Value | Units | Method | Reference | Comment |
---|---|---|---|---|---|
ΔrH° | 14.1 ± 0.3 | kJ/mol | Eqk | Rodova, Levanova, et al., 1973 | gas phase; At 348 K |

Normal alkane RI, non-polar column, isothermal

Column type | Active phase | Temperature (C) | I | Reference | Comment |
---|---|---|---|---|---|
Capillary | Apiezon L | 130. | 738. | Arruda, Junkes, et al., 2008 |

Normal alkane RI, non-polar column, custom temperature program

Column type | Active phase | I | Reference | Comment |
---|---|---|---|---|
Capillary | Polydimethyl siloxanes | 724. | Zenkevich, 2003 | Program: not specified |
Capillary | Methyl Silicone | 724. | Zenkevich and Marinichev, 2001 | Program: not specified |
Capillary | Polydimethyl siloxanes | 724. | Zenkevich, 1998 | Program: not specified |

References

Weast and Grasselli, 1989
CRC Handbook of Data on Organic Compounds, 2nd Editon, Weast,R.C and Grasselli, J.G., ed(s)., CRC Press, Inc., Boca Raton, FL, 1989, 1. [all data]
Anonymous, 1966
Anonymous, P.,
, 1966. [all data]
Rust and Vaughan, 1941
Rust, F.F.; Vaughan, W.E.,
The high temperature chlorination of saturated aliphatic monochlorides. a " vicinal" effect.,
J. Org. Chem., 1941, 6, 479-88. [all data]
Tishchenko and Churbakov, 1937
Tishchenko, D.V.; Churbakov, A.N.,
Zh. Obshch. Khim., 1937, 7, 893. [all data]
He, An, et al., 1992
He, J.; An, X.-W.; Hu, R.-H.,
Enthalpies of vaporization of five dichlorobutanes,
Acta Chim. Sin., 1992, 50, 10, 943. [all data]
Basarová and Svoboda, 1991
Basarová, Pavlína; Svoboda, Václav,
Calculation of heats of vaporization of halogenated hydrocarbons from saturated vapour pressure data,
Fluid Phase Equilibria, 1991, 68, 13-34, https://doi.org/10.1016/0378-3812(91)85008-I
. [all data]
Pisarev, Rozhnov, et al., 1977
Pisarev, V.V.; Rozhnov, A.M.; Sarkisov, A.G.,
Russ. J. Phys. Chem., 1977, 51, 323. [all data]
Stephenson and Malanowski, 1987
Stephenson, Richard M.; Malanowski, Stanislaw,
Handbook of the Thermodynamics of Organic Compounds, 1987, https://doi.org/10.1007/978-94-009-3173-2
. [all data]
Levanova, Rozhnov, et al., 1972
Levanova, S.V.; Rozhnov, A.M.; Bortnik, O.K.,
Isomerization of dibromoethylenes,
Izv. Vyssh. Uchebn. Zaved., Khim. Khim. Tekhnol., 1972, 15, 1821-1823. [all data]
Rodova, Levanova, et al., 1973
Rodova, R.M.; Levanova, S.V.; Shevtsova, L.A.; Rozhnov, A.M.; Porfir'eva, E.I.,
Reversible reactions of 2,3-dichlorobutane,
Russ. J. Phys. Chem. (Engl. Transl.), 1973, 47, 607. [all data]
Arruda, Junkes, et al., 2008
Arruda, A.C.S.; Junkes, B. da.S.; Souza, E.S.; Yunes, R.A.; Heizen, V.E.F.,
Semi-Emlirical Topological Index to Predict Properties of Halogenated Aliphatic Compounds,
J. Chemometrics, 2008, 22, 3-4, 186-194, https://doi.org/10.1002/cem.1121
. [all data]
Zenkevich, 2003
Zenkevich, I.G.,
Criteria for Evaluation of Elution Order of Isomeric Organic Compounds,
Zh. Phys. Khim. (Rus.), 2003, 77, 1, 92-98. [all data]
Zenkevich and Marinichev, 2001
Zenkevich, I.G.; Marinichev, A.N.,
Comparison of Topological and Dynamics Molecular Characteristics for Precalculation of Chromatographic Retention Parameters of Organic Compounds (in Russian),
Zh. Struct. Khim., 2001, 42, 5, 893-902. [all data]
Zenkevich, 1998
Zenkevich, I.G.,
The Principle of Structural Analogy in the Calculation of Gas Chromatographic Retention Indices using Physico-Chemical Constants of Organic Compounds,
Zh. Anal. Khim. (Rus.), 1998, 53, 1, 43-49. [all data]