1-(2-Hydroxyphenyl)-3-phenyl-1-propanone
- Formula: C15H14O2
- Molecular weight: 226.2705
- IUPAC Standard InChIKey: JCPGMXJLFWGRMZ-UHFFFAOYSA-N
- CAS Registry Number: 42772-82-7
- Chemical structure:
View 3d structure (requires JavaScript / HTML 5) - Other names: 2'-Hydroxy-3-phenylpropiophenone; o-Hydroxy-β-phenyl propiophenone; 1-Propanone, 1-(2-hydroxyphenyl)-2-phenyl-; PROPAFENONE-H2O, M(O-DESALKYL-)

Kovats' RI, non-polar column, temperature ramp

Column type | Active phase | I | Reference | Comment |
---|---|---|---|---|
Packed | OV-101 | 1830. | Maurer, 1990 | N2, Chromosorb G HP, 100. C @ 3. min, 30. K/min, 310. C @ 5. min; Column length: 0.60 m |

References

Maurer, 1990
Maurer, H.H.,
Identification of antiarrhythmic drugs and their metabolites in urine,
Arch. Toxicol., 1990, 64, 3, 218-230, https://doi.org/10.1007/BF02010728
. [all data]