Undecanol-4
- Formula: C11H24O
- Molecular weight: 172.3077
- IUPAC Standard InChIKey: FNORHVDKJWGANC-UHFFFAOYSA-N
- CAS Registry Number: 4272-06-4
- Chemical structure:
View 3d structure (requires JavaScript / HTML 5) - Other names: 4-Undecanol; undecan-4-ol

Kovats' RI, polar column, isothermal

Column type | Active phase | Temperature (C) | I | Reference | Comment |
---|---|---|---|---|---|
Packed | Carbowax 20M | 130. | 1648. | Singliar, 1972 | Column length: 2.55 m |
Packed | Carbowax 20M | 165. | 1651. | Singliar, 1972 | Column length: 2.55 m |

Kovats' RI, polar column, temperature ramp

Column type | Active phase | I | Reference | Comment |
---|---|---|---|---|
Capillary | Innowax | 1672. | Mahmood, Kaul, et al., 2004 | 30. m/0.25 mm/0.25 μm, He, 5. K/min, 190. C @ 5. min; Tstart: 40. C |

Normal alkane RI, polar column, custom temperature program

Column type | Active phase | I | Reference | Comment |
---|---|---|---|---|
Capillary | PEG-20M | 1682. | Qin, 2009 | Program: not specified |

References

Singliar, 1972
Singliar, M.,
Chromatographic Behaviour and the Structure of Secondary Aliphatic Alcohols,
J. Chromatogr., 1972, 65, 1, 311-321, https://doi.org/10.1016/S0021-9673(00)86946-0
. [all data]
Mahmood, Kaul, et al., 2004
Mahmood, U.; Kaul, V.K.; Acharya, R.,
Volatile constituents of Capillipedium parviflorum,
Phytochemistry, 2004, 65, 14, 2163-2166, https://doi.org/10.1016/j.phytochem.2004.04.003
. [all data]
Qin, 2009
Qin, Z.,
Relationship between the molecular structure and gas chromatographic retention index of alcohol isomer,
J. Xuzhou Norm. Univ. (Nat. Sci. Edn.), 2009, 27, 2, 88-90. [all data]