C7H6F3NO2S
- Formula: C7H6F3NO2S
- Molecular weight: 225.188
- CAS Registry Number: 426-59-5

Reaction thermochemistry data

Data compiled by: John E. Bartmess
Individual Reactions
C7H5F3NO2S- + = C7H6F3NO2S
By formula: C7H5F3NO2S- + H+ = C7H6F3NO2S
Quantity | Value | Units | Method | Reference | Comment |
---|---|---|---|---|---|
ΔrH° | 346.9 ± 2.1 | kcal/mol | G+TS | Taft and Topsom, 1987 | gas phase |
Quantity | Value | Units | Method | Reference | Comment |
ΔrG° | 339.6 ± 2.0 | kcal/mol | IMRE | Taft and Topsom, 1987 | gas phase |

Gas phase ion energetics data

Data compiled by: John E. Bartmess
De-protonation reactions
C7H5F3NO2S- + = C7H6F3NO2S
By formula: C7H5F3NO2S- + H+ = C7H6F3NO2S
Quantity | Value | Units | Method | Reference | Comment |
---|---|---|---|---|---|
ΔrH° | 346.9 ± 2.1 | kcal/mol | G+TS | Taft and Topsom, 1987 | gas phase |
Quantity | Value | Units | Method | Reference | Comment |
ΔrG° | 339.6 ± 2.0 | kcal/mol | IMRE | Taft and Topsom, 1987 | gas phase |

References

Taft and Topsom, 1987
Taft, R.W.; Topsom, R.D.,
The Nature and Analysis of Substituent Effects,
Prog. Phys. Org. Chem., 1987, 16, 1. [all data]