Benzene, 1-butyl-2-ethyl-
- Formula: C12H18
- Molecular weight: 162.2713
- IUPAC Standard InChIKey: QTIAYNBMYSOJME-UHFFFAOYSA-N
- CAS Registry Number: 42548-38-9
- Chemical structure:
View 3d structure (requires JavaScript / HTML 5) - Other names: Benzene, 1-ethyl-2-butyl; 1-ethyl-2-n-butylbenzene

Kovats' RI, non-polar column, isothermal

Column type | Active phase | Temperature (C) | I | Reference | Comment |
---|---|---|---|---|---|
Capillary | Squalane | 100. | 1209. | Nabivach and Vasiliev, 1987 | |
Packed | Squalane | 95.4 | 1208. | Soják, Janák, et al., 1977 | |
Capillary | Squalane | 100. | 1211.2 | Soják and Hrivnák, 1972 | H2; Column length: 200. m; Column diameter: 0.2 mm |
Capillary | Squalane | 115. | 1215.3 | Soják and Hrivnák, 1972 | H2; Column length: 200. m; Column diameter: 0.2 mm |
Capillary | Squalane | 130. | 1220.1 | Soják and Hrivnák, 1972 | H2; Column length: 200. m; Column diameter: 0.2 mm |

Kovats' RI, polar column, isothermal

Column type | Active phase | Temperature (C) | I | Reference | Comment |
---|---|---|---|---|---|
Capillary | Carbowax 20M | 90. | 1454.5 | Döring, Estel, et al., 1974 | Column length: 100. m; Column diameter: 0.2 mm |

Normal alkane RI, polar column, isothermal

Column type | Active phase | Temperature (C) | I | Reference | Comment |
---|---|---|---|---|---|
Capillary | Carbowax 20M | 90. | 1454. | Sutter, Peterson, et al., 1997 |

Normal alkane RI, polar column, custom temperature program

Column type | Active phase | I | Reference | Comment |
---|---|---|---|---|
Capillary | Carbowax 20M | 1454. | Ivanciuc, Ivanciuc, et al., 2001 | Program: not specified |

References

Nabivach and Vasiliev, 1987
Nabivach, V.M.; Vasiliev, E.E.E.,
Correlation dependencies of GC retention indices from physical chemical properties and structures of aromatic hydrocarbons,
Izv. Vyssh. Uchebn. Zaved. Khim. Khim. Tekhnol., 1987, 30, 72-75. [all data]
Soják, Janák, et al., 1977
Soják, L.; Janák, J.; Rijks, J.A.,
Capillary gas chromatography of alkylbenzenes. II. Correlations between the structures and methylene group increments and differences in retention indices of isomers,
J. Chromatogr., 1977, 135, 1, 71-84, https://doi.org/10.1016/S0021-9673(00)86303-7
. [all data]
Soják and Hrivnák, 1972
Soják, L.; Hrivnák, J.,
Open tubular column gas chromatography of the catalytic dehydrogenation products of n-dodecane,
J. Chromatogr. Sci., 1972, 10, 11, 701-704, https://doi.org/10.1093/chromsci/10.11.701
. [all data]
Döring, Estel, et al., 1974
Döring, C.E.; Estel, D.; Fischer, R.,
Kapillar-gaschromatographische Charakterisierung von C10-bis C12-Aromaten,
J. Prakt. Chem., 1974, 316, 1, 1-12, https://doi.org/10.1002/prac.19743160102
. [all data]
Sutter, Peterson, et al., 1997
Sutter, J.M.; Peterson, T.A.; Jurs, P.C.,
Prediction of gas chromatographic retention indices of alkylbenzenes,
Anal. Chim. Acta., 1997, 342, 2-3, 113-122, https://doi.org/10.1016/S0003-2670(96)00578-8
. [all data]
Ivanciuc, Ivanciuc, et al., 2001
Ivanciuc, O.; Ivanciuc, T.; Klein, D.J.; Seitz, W.A.; Balaban, A.T.,
Quantitative structure-retention relationships for gas chromatographic retention indices of alkylbenzenes with molecular graph descriptors,
SAR QSAR Environ. Res., 2001, 11, 5-6, 419-452, https://doi.org/10.1080/10629360108035362
. [all data]