R-(-)-1,2-propanediol
- Formula: C3H8O2
- Molecular weight: 76.0944
- IUPAC Standard InChIKey: DNIAPMSPPWPWGF-GSVOUGTGSA-N
- CAS Registry Number: 4254-14-2
- Chemical structure:
View 3d structure (requires JavaScript / HTML 5) - Stereoisomers:
- Other names: 1,2-Propanediol, (R)-; PROPANE-1,2-DIOL,(R)-(-)-; (R)-Propylene glycol; (R)-1,2-propanediol (propylene glycol)

Phase change data

Data compiled as indicated in comments:
TRC - Thermodynamics Research Center, NIST Boulder Laboratories, Chris Muzny director
AC - William E. Acree, Jr., James S. Chickos
Quantity | Value | Units | Method | Reference | Comment |
---|---|---|---|---|---|
Tboil | 461.15 | K | N/A | Levene and Walsh, 1943 | Uncertainty assigned by TRC = 2. K; TRC |
Enthalpy of fusion
ΔfusH (kJ/mol) | Temperature (K) | Reference | Comment |
---|---|---|---|
8.4 | 240. | Jabrane, Létoffé, et al., 1995 | AC |

References

Levene and Walsh, 1943
Levene, P.A.; Walsh,
Organic Synthesis, Collective Vol. II, 1943. [all data]
Jabrane, Létoffé, et al., 1995
Jabrane, S.; Létoffé, J.M.; Claudy, P.,
Vitrification and crystallization in the R(-)1,2-propanediol-S(+)1,2-propanediol system,
Thermochimica Acta, 1995, 258, 33-47, https://doi.org/10.1016/0040-6031(94)02235-G
. [all data]