Pentane, 1,3-dibromo-
- Formula: C5H10Br2
- Molecular weight: 229.941
- IUPAC Standard InChIKey: SOZLNIPBRVQUOG-UHFFFAOYSA-N
- CAS Registry Number: 42474-20-4
- Chemical structure:
View 3d structure (requires JavaScript / HTML 5) - Other names: 1,3-Dibromopentane

Condensed phase thermochemistry data

Data compiled by: Hussein Y. Afeefy, Joel F. Liebman, and Stephen E. Stein
Quantity | Value | Units | Method | Reference | Comment |
---|---|---|---|---|---|
ΔfH°liquid | -170.8 | kJ/mol | Eqk | Rozhnov, Alenin, et al., 1974 |

Reaction thermochemistry data

Data compiled by: Hussein Y. Afeefy, Joel F. Liebman, and Stephen E. Stein
Individual Reactions
By formula: C5H10Br2 = C5H10Br2
Quantity | Value | Units | Method | Reference | Comment |
---|---|---|---|---|---|
ΔrH° | -2.5 ± 0.08 | kJ/mol | Eqk | Rozhnov, Nesterova, et al., 1974 | liquid phase; Heat of isomerization |
By formula: C5H10Br2 = C5H10Br2
Quantity | Value | Units | Method | Reference | Comment |
---|---|---|---|---|---|
ΔrH° | -5.9 ± 0.4 | kJ/mol | Eqk | Rozhnov, Nesterova, et al., 1974 | liquid phase; Heat of isomerization |

References

Rozhnov, Alenin, et al., 1974
Rozhnov, A.M.; Alenin, V.I.; Nesterova, T.N.,
Equilibrium in the isomerisation of dibromoalkanes. IV. Isomerisation of dibromohexanes and heats of formation of certain C5-C10 dibromoalkanes,
Russ. J. Phys. Chem. (Engl. Transl.), 1974, 48, 1701-1702. [all data]
Rozhnov, Nesterova, et al., 1974
Rozhnov, A.M.; Nesterova, T.N.; Alenin, V.I.; Uskova, L.A.,
Equilibria in the isomerisation of dibromoalkanes. I. Isomerisation of 1,2-, 1,3-, 1,4-, and 1,5-dibromopentanes,
Russ. J. Phys. Chem. (Engl. Transl.), 1974, 48, 1268, In original 2136. [all data]