Ethanone, 1-(2,3-dihydro-1H-inden-5-yl)-
- Formula: C11H12O
- Molecular weight: 160.2124
- IUPAC Standard InChIKey: ZDDDIYOBAOJYAZ-UHFFFAOYSA-N
- CAS Registry Number: 4228-10-8
- Chemical structure:
View 3d structure (requires JavaScript / HTML 5) - Other names: Ketone, 5-indanyl methyl; 5-Acetylindan; 5-Acetylindane; 1-Indan-1-ylethanone

Phase change data

Data compiled by: Robert L. Brown and Stephen E. Stein
Reduced pressure boiling point
Tboil (K) | Pressure (bar) | Reference |
---|---|---|
415. | 0.020 | Buckingham and Donaghy, 1982 |

Van Den Dool and Kratz RI, non-polar column, temperature ramp

Column type | Active phase | I | Reference | Comment |
---|---|---|---|---|
Capillary | VF-5MS | 1546. | N/A | 30. m/0.25 mm/0.25 μm, He; Tstart: 60. C; Tend: 270. C |

References

Buckingham and Donaghy, 1982
Buckingham, J.; Donaghy, S.M.,
Dictionary of Organic Compounds: Fifth Edition, Chapman and Hall, New York, 1982, 1. [all data]