4H-Pyran-4-one, 2-methoxy-6-methyl-
- Formula: C7H8O3
- Molecular weight: 140.1366
- IUPAC Standard InChIKey: SGHBBBQKUYEJPS-UHFFFAOYSA-N
- CAS Registry Number: 4225-42-7
- Chemical structure:

Phase change data

Data compiled as indicated in comments:
ALS - Hussein Y. Afeefy, Joel F. Liebman, and Stephen E. Stein
AC - William E. Acree, Jr., James S. Chickos
Quantity | Value | Units | Method | Reference | Comment |
---|---|---|---|---|---|
ΔvapH° | 71. ± 3. | kJ/mol | V | Beak, Mueller, et al., 1974 | ALS |
Enthalpy of vaporization
ΔvapH (kJ/mol) | Temperature (K) | Method | Reference | Comment |
---|---|---|---|---|
72.8 | 377. | A | Stephenson and Malanowski, 1987 | Based on data from 370. to 384. K.; AC |

Reaction thermochemistry data

Data compiled by: Hussein Y. Afeefy, Joel F. Liebman, and Stephen E. Stein
Individual Reactions
By formula: C7H8O3 = C7H8O3
Quantity | Value | Units | Method | Reference | Comment |
---|---|---|---|---|---|
ΔrH° | -24. ± 3. | kJ/mol | Ciso | Beak, Mueller, et al., 1974 | liquid phase; solvent: 1,2-Dichloroethane; #LED |
ΔrH° | -37. ± 8.8 | kJ/mol | Ciso | Beak, Mueller, et al., 1974 | gas phase; Hr gas phase |

References

Beak, Mueller, et al., 1974
Beak, P.; Mueller, D.S.; Lee, J.,
Equilibration studies. Determination of the enthalpy difference between methyltropic isomers from heats of methylation,
J. Am. Chem. Soc., 1974, 96, 3867-3874. [all data]
Stephenson and Malanowski, 1987
Stephenson, Richard M.; Malanowski, Stanislaw,
Handbook of the Thermodynamics of Organic Compounds, 1987, https://doi.org/10.1007/978-94-009-3173-2
. [all data]