2,4-Imidazolidinedione, 3-methyl-5,5-diphenyl-
- Formula: C16H14N2O2
- Molecular weight: 266.2946
- IUPAC Standard InChIKey: LTYDTBHSPIJPEG-UHFFFAOYSA-N
- CAS Registry Number: 4224-00-4
- Chemical structure:
View 3d structure (requires JavaScript / HTML 5) - Other names: Hydantoin, 3-methyl-5,5-diphenyl-; Hydotin; Melantoin; Methylphenytoin; 3-Methyl-5,5-diphenylhydantoin; 3-Methyl-5,5-diphenyl-2,4-imidazolidinedione

Van Den Dool and Kratz RI, non-polar column, temperature ramp

Column type | Active phase | I | Reference | Comment |
---|---|---|---|---|
Capillary | VF-5MS | 2299. | Todua, 2011 | 30. m/0.25 mm/0.25 μm, He; Tstart: 60. C; Tend: 270. C |

References

Todua, 2011
Todua, N.G.,
Retention Data. NIST Mass Spectrometry Data Center., NIST Mass Spectrometry Data Center, 2011. [all data]