3-Methyl-3-chlorodiazirine
- Formula: C2H3ClN2
- Molecular weight: 90.512
- IUPAC Standard InChIKey: PGWJHJYENHOJDU-UHFFFAOYSA-N
- CAS Registry Number: 4222-21-3
- Chemical structure:
View 3d structure (requires JavaScript / HTML 5) - Permanent link for this species. Use this link for bookmarking this species for future reference.

Gas phase thermochemistry data

Data compiled by: Hussein Y. Afeefy, Joel F. Liebman, and Stephen E. Stein
Quantity | Value | Units | Method | Reference | Comment |
---|---|---|---|---|---|
ΔfH°gas | 233. ± 40. | kJ/mol | Cm | Archer and Tyler, 1976 | |
ΔfH°gas | 243. | kJ/mol | Ion | Cadman, Engelbrecht, et al., 1974 | Photochemical decomposition |

Reaction thermochemistry data

Data compiled by: Hussein Y. Afeefy, Joel F. Liebman, and Stephen E. Stein
Individual Reactions
By formula: C2H3ClN2 = C2H3Cl + N2
Quantity | Value | Units | Method | Reference | Comment |
---|---|---|---|---|---|
ΔrH° | -196. ± 14. | kJ/mol | Cm | Archer and Tyler, 1976 | gas phase |

References

Archer and Tyler, 1976
Archer, W.H.; Tyler, B.J.,
Self-heating in the decomposition of 3-methyl-3-chlorodiazirine: Determination of reaction exothermicity and correction of Arrhenius parameters,
J. Chem. Soc. Faraday Trans. 1, 1976, 72, 1448-1455. [all data]
Cadman, Engelbrecht, et al., 1974
Cadman, P.; Engelbrecht, W.J.; Lotz, S.; Van Der Merwe, S.W.J.,
Energy distribution in reaction products. The photolysis of 3-halo-3-methyldiazirines,
J. S. African Chem. Inst., 1974, 27, 149-161. [all data]