(+)-(4S)-α-phellandrene
- Formula: C10H16
- Molecular weight: 136.2340
- IUPAC Standard InChIKey: OGLDWXZKYODSOB-JTQLQIEISA-N
- CAS Registry Number: 4221-98-1
- Chemical structure:
View 3d structure (requires JavaScript / HTML 5) - Stereoisomers:
- Other names: 1-phellandrene; (R)-5-isopropyl-2-methylcyclohexa-1,3-diene; 1,3-Cyclohexadiene, 2-methyl-5-(1-methylethyl)-, (r)-

Condensed phase thermochemistry data

Data compiled by: Hussein Y. Afeefy, Joel F. Liebman, and Stephen E. Stein
Quantity | Value | Units | Method | Reference | Comment |
---|---|---|---|---|---|
ΔcH°liquid | -6014.1 | kJ/mol | Ccb | Roth-Greifswald, 1911 | Heat of combustion corrected for pressure; Corresponding ΔfHºliquid = -208. kJ/mol (simple calculation by NIST; no Washburn corrections) |
ΔcH°liquid | -6013.2 | kJ/mol | Ccb | Auwsers, Roth, et al., 1910 | Corresponding ΔfHºliquid = -208. kJ/mol (simple calculation by NIST; no Washburn corrections) |

Phase change data

Data compiled by: William E. Acree, Jr., James S. Chickos
Quantity | Value | Units | Method | Reference | Comment |
---|---|---|---|---|---|
ΔvapH° | 46.9 | kJ/mol | GC | Hoskovec, Grygarová, et al., 2005 | Based on data from 313. to 413. K. |
ΔvapH° | 48.3 | kJ/mol | GC | Hoskovec, Grygarová, et al., 2005 | Based on data from 313. to 423. K. |

References

Roth-Greifswald, 1911
Roth-Greifswald, W.A.,
XVIII. Hauptversammlung der Deutschen Bunsen-Gesellschaft fur angewandte physikalische Chemie,
Z. Electrochem., 1911, 17, 789-840. [all data]
Auwsers, Roth, et al., 1910
Auwsers, K.; Roth, W.A.; Eisenlohr, F.,
III. Verbrennungswarmen von Terpenen und Styrolen,
Justus Liebigs Ann. Chem., 1910, 267-290. [all data]
Hoskovec, Grygarová, et al., 2005
Hoskovec, Michal; Grygarová, Dana; Cvacka, Josef; Streinz, Ludvík; Zima, Jirí; Verevkin, Sergey P.; Koutek, Bohumír,
Determining the vapour pressures of plant volatiles from gas chromatographic retention data,
Journal of Chromatography A, 2005, 1083, 1-2, 161-172, https://doi.org/10.1016/j.chroma.2005.06.006
. [all data]