5-hydroxyvaleraldehyde
- Formula: C5H10O2
- Molecular weight: 102.1317
- IUPAC Standard InChIKey: CNRGMQRNYAIBTN-UHFFFAOYSA-N
- CAS Registry Number: 4221-03-8
- Chemical structure:
View 3d structure (requires JavaScript / HTML 5) - Other names: 5-hydroxypentanal

Reaction thermochemistry data

Data compiled by: Hussein Y. Afeefy, Joel F. Liebman, and Stephen E. Stein
Individual Reactions
By formula: C5H10O2 = C5H10O2
Quantity | Value | Units | Method | Reference | Comment |
---|---|---|---|---|---|
ΔrH° | 23. | kJ/mol | Eqk | Shono, Godo, et al., 1971 | liquid phase; solvent: DMSO-d6; NMR |

References

Shono, Godo, et al., 1971
Shono, T.; Godo, M.; Shinra, K.,
High resolution NMR studies of ring-chain tautomerism in ω-hydroxy aldehydes,
Bunseki Kagaku, 1971, 20, 1183-1186. [all data]