Bicyclo[4.2.0]octa-1,5-diene
- Formula: C8H10
- Molecular weight: 106.1650
- IUPAC Standard InChIKey: LKVVIADCTAYVMJ-UHFFFAOYSA-N
- CAS Registry Number: 42206-10-0
- Chemical structure:
View 3d structure (requires JavaScript / HTML 5) - Permanent link for this species. Use this link for bookmarking this species for future reference.

Gas phase thermochemistry data

Data compiled by: Hussein Y. Afeefy, Joel F. Liebman, and Stephen E. Stein
Quantity | Value | Units | Method | Reference | Comment |
---|---|---|---|---|---|
ΔfH°gas | 222. | kJ/mol | Chyd | Roth, Scholz, et al., 1982 |

Condensed phase thermochemistry data

Data compiled by: Hussein Y. Afeefy, Joel F. Liebman, and Stephen E. Stein
Quantity | Value | Units | Method | Reference | Comment |
---|---|---|---|---|---|
ΔfH°liquid | 181. | kJ/mol | Chyd | Roth, Scholz, et al., 1982 |

Phase change data

Data compiled by: Donald R. Burgess, Jr.
Quantity | Value | Units | Method | Reference | Comment |
---|---|---|---|---|---|
ΔvapH° | 41.0 | kJ/mol | N/A | Roth, Scholz, et al., 1982 |

Reaction thermochemistry data

Data compiled by: Hussein Y. Afeefy, Joel F. Liebman, and Stephen E. Stein
Individual Reactions
By formula: 2H2 + C8H10 = C8H14
Quantity | Value | Units | Method | Reference | Comment |
---|---|---|---|---|---|
ΔrH° | -249. | kJ/mol | Chyd | Roth, Scholz, et al., 1982 | liquid phase |

References

Roth, Scholz, et al., 1982
Roth, W.R.; Scholz, B.P.; Breuckmann, R.; Jelich, K.; Lennartz, H.W.,
Thermolysis of 1,2,6,7-octatetraene,
Chem. Ber., 1982, 115, 1934-1946. [all data]