Phosphonous dichloride, (trifluoromethyl)-

Phase change data

Data compiled by: William E. Acree, Jr., James S. Chickos

Enthalpy of vaporization

ΔvapH (kJ/mol) Temperature (K) Reference Comment
29.2260.Peterson and Burg, 1964Based on data from 208. - 276. K.

References

Peterson and Burg, 1964
Peterson, Louis K.; Burg, Anton B., Acetoxyphosphines, J. Am. Chem. Soc., 1964, 86, 13, 2587-2591, https://doi.org/10.1021/ja01067a014 . [all data]