2-Amino-5-nitropyridine
- Formula: C5H5N3O2
- Molecular weight: 139.1121
- IUPAC Standard InChIKey: UGSBCCAHDVCHGI-UHFFFAOYSA-N
- CAS Registry Number: 4214-76-0
- Chemical structure:
View 3d structure (requires JavaScript / HTML 5) - Other names: 2-Pyridinamine, 5-nitro-; Pyridine, 2-amino-5-nitro-; 5-Nitro-2-aminopyridine; 5-nitropyrimidin-2-ylamine

Phase change data

Data compiled by: William E. Acree, Jr., James S. Chickos
Enthalpy of fusion
ΔfusH (kcal/mol) | Temperature (K) | Method | Reference | Comment |
---|---|---|---|---|
6.98 | 461.4 | AC | Shi, Tan, et al., 2007 | Based on data from 80. to 395. K. |

Reaction thermochemistry data

Data compiled by: John E. Bartmess
Individual Reactions
C5H4N3O2- + =
By formula: C5H4N3O2- + H+ = C5H5N3O2
Quantity | Value | Units | Method | Reference | Comment |
---|---|---|---|---|---|
ΔrH° | 341.6 ± 2.9 | kcal/mol | G+TS | Breuker, Knochenmuss, et al., 1999 | gas phase; Acid: 2-amino-5-nitropyridine |
Quantity | Value | Units | Method | Reference | Comment |
ΔrG° | 334.3 ± 2.7 | kcal/mol | IMRB | Breuker, Knochenmuss, et al., 1999 | gas phase; Acid: 2-amino-5-nitropyridine |

Gas phase ion energetics data

Data compiled by: John E. Bartmess
De-protonation reactions
C5H4N3O2- + =
By formula: C5H4N3O2- + H+ = C5H5N3O2
Quantity | Value | Units | Method | Reference | Comment |
---|---|---|---|---|---|
ΔrH° | 341.6 ± 2.9 | kcal/mol | G+TS | Breuker, Knochenmuss, et al., 1999 | gas phase; Acid: 2-amino-5-nitropyridine |
Quantity | Value | Units | Method | Reference | Comment |
ΔrG° | 334.3 ± 2.7 | kcal/mol | IMRB | Breuker, Knochenmuss, et al., 1999 | gas phase; Acid: 2-amino-5-nitropyridine |

References

Shi, Tan, et al., 2007
Shi, Quan; Tan, Zhi-Cheng; Di, You-Ying; Tong, Bo; Wang, Shao-Xu; Li, Yan-Sheng,
Thermodynamic studies of crystalline 2-amino-5-nitropyridine (C5H5N3O2),
Thermochimica Acta, 2007, 463, 1-2, 6-9, https://doi.org/10.1016/j.tca.2007.04.006
. [all data]
Breuker, Knochenmuss, et al., 1999
Breuker, K.; Knochenmuss, R.; Zenobi, R.,
Gas-phase basicities of deprotonated matrix-assisted laser desorption/ionization matrix molecules,
Int. J. Mass Spectrom., 1999, 184, 1, 25-38, https://doi.org/10.1016/S1387-3806(98)14200-8
. [all data]