2-Pentene, 2-chloro-, (E)-
- Formula: C5H9Cl
- Molecular weight: 104.578
- IUPAC Standard InChIKey: KQLXLZMCYSIZHH-SNAWJCMRSA-N
- CAS Registry Number: 42132-00-3
- Chemical structure:
View 3d structure (requires JavaScript / HTML 5) - Stereoisomers:

Reaction thermochemistry data

Data compiled by: Hussein Y. Afeefy, Joel F. Liebman, and Stephen E. Stein
Individual Reactions
By formula: C5H9Cl = C5H9Cl
Quantity | Value | Units | Method | Reference | Comment |
---|---|---|---|---|---|
ΔrH° | -11.20 | kJ/mol | Ciso | Shishinova, Levanova, et al., 1978 | gas phase; Gas phase |
By formula: C5H9Cl = C5H9Cl
Quantity | Value | Units | Method | Reference | Comment |
---|---|---|---|---|---|
ΔrH° | -3.85 | kJ/mol | Ciso | Shishinova, Levanova, et al., 1978 | gas phase; Gas phase |
By formula: C5H10Cl2 = C5H9Cl + HCl
Quantity | Value | Units | Method | Reference | Comment |
---|---|---|---|---|---|
ΔrH° | 47.488 | kJ/mol | Eqk | Shishinova, Levanova, et al., 1978 | gas phase |

References

Shishinova, Levanova, et al., 1978
Shishinova, V.I.; Levanova, S.V.; Shevtsova, L.A.; Rozhnov, A.M.; Tokarevskii, V.A.,
Dehydrochlorination of 2,2-dichloropentane,
Russ. J. Phys. Chem. (Engl. Transl.), 1978, 52, 285-286. [all data]