1-Pentene, 2-chloro-
- Formula: C5H9Cl
- Molecular weight: 104.578
- IUPAC Standard InChIKey: RYAVTKZLXAVVAQ-UHFFFAOYSA-N
- CAS Registry Number: 42131-85-1
- Chemical structure:
View 3d structure (requires JavaScript / HTML 5) - Other names: 2-Chloro-1-pentene

Reaction thermochemistry data

Data compiled by: Hussein Y. Afeefy, Joel F. Liebman, and Stephen E. Stein
Individual Reactions
By formula: C5H9Cl = C5H9Cl
Quantity | Value | Units | Method | Reference | Comment |
---|---|---|---|---|---|
ΔrH° | -7.351 | kJ/mol | Ciso | Shishinova, Levanova, et al., 1978 | gas phase; Gas phase |
By formula: C5H9Cl = C5H9Cl
Quantity | Value | Units | Method | Reference | Comment |
---|---|---|---|---|---|
ΔrH° | -11.20 | kJ/mol | Ciso | Shishinova, Levanova, et al., 1978 | gas phase; Gas phase |
By formula: C5H10Cl2 = C5H9Cl + HCl
Quantity | Value | Units | Method | Reference | Comment |
---|---|---|---|---|---|
ΔrH° | 58.689 | kJ/mol | Eqk | Shishinova, Levanova, et al., 1978 | gas phase |

Normal alkane RI, non-polar column, temperature ramp

Column type | Active phase | I | Reference | Comment |
---|---|---|---|---|
Capillary | OV-101 | 679. | Zenkevich, 2005 | 25. m/0.20 mm/0.10 μm, N2/He, 6. K/min; Tstart: 50. C; Tend: 250. C |

References

Shishinova, Levanova, et al., 1978
Shishinova, V.I.; Levanova, S.V.; Shevtsova, L.A.; Rozhnov, A.M.; Tokarevskii, V.A.,
Dehydrochlorination of 2,2-dichloropentane,
Russ. J. Phys. Chem. (Engl. Transl.), 1978, 52, 285-286. [all data]
Zenkevich, 2005
Zenkevich, I.G.,
Experimentally measured retention indices., 2005. [all data]