4-Hexen-1-ol, acetate, (Z)-
- Formula: C8H14O2
- Molecular weight: 142.1956
- IUPAC Standard InChIKey: SXIMDPDAXHQFFD-ARJAWSKDSA-N
- CAS Registry Number: 42125-17-7
- Chemical structure:
View 3d structure (requires JavaScript / HTML 5) - Stereoisomers:
- Other names: (4Z)-4-Hexenyl acetate; (Z)-4-Hexen-1-yl, acetate; cis-4-Hexen-1-yl acetate

Normal alkane RI, non-polar column, temperature ramp

Column type | Active phase | I | Reference | Comment |
---|---|---|---|---|
Capillary | DB-1 | 1001. | Shiota, 1993 | 30. m/0.25 mm/0.25 μm, He, 50. C @ 3. min, 5. K/min; Tend: 240. C |
Capillary | DB-1 | 998. | Shiota, 1993 | 30. m/0.25 mm/0.25 μm, He, 50. C @ 3. min, 5. K/min; Tend: 240. C |

References

Shiota, 1993
Shiota, H.,
New esteric components in the volatiles of banana fruit (Musa sapientum L.),
J. Agric. Food Chem., 1993, 41, 11, 2056-2062, https://doi.org/10.1021/jf00035a046
. [all data]