2-Penten-1-ol, acetate, (Z)-
- Formula: C7H12O2
- Molecular weight: 128.1690
- IUPAC Standard InChIKey: WGGJTPQHVFOGPN-PLNGDYQASA-N
- CAS Registry Number: 42125-10-0
- Chemical structure:
View 3d structure (requires JavaScript / HTML 5) - Other names: (2Z)-2-Pentenyl acetate; cis-2-Penten-1-ol, acetate; (Z)-2-Pentenyl acetate; 2-Penten-1-ol, acetate, (2Z)-; (Z)-Pent-2-en-1-yl acetate

Van Den Dool and Kratz RI, non-polar column, custom temperature program

Column type | Active phase | I | Reference | Comment |
---|---|---|---|---|
Capillary | VF-5MS | 908.7 | Tret'yakov, 2008 | 30. m/0.25 mm/0.25 μm, He; Program: Multi-step temperature program; T(initial)=60C; T(final)=270C |

Normal alkane RI, non-polar column, temperature ramp

Column type | Active phase | I | Reference | Comment |
---|---|---|---|---|
Capillary | CP Sil 5 CB | 897. | Rohloff and Bones, 2005 | 30. m/0.25 mm/0.25 μm, He, 40. C @ 1. min, 4. K/min; Tend: 220. C |

References

Tret'yakov, 2008
Tret'yakov, K.V.,
Retention Data. NIST Mass Spectrometry Data Center., NIST Mass Spectrometry Data Center, 2008. [all data]
Rohloff and Bones, 2005
Rohloff, J.; Bones, A.M.,
Volatile profiling of Arabidopsis thaliana - Putative olfactory compounds in plant communication,
Phytochemistry, 2005, 66, 16, 1941-1955, https://doi.org/10.1016/j.phytochem.2005.06.021
. [all data]