CAS Reg. No. 42117-14-6
- CAS Registry Number: 42117-14-6

Reaction thermochemistry data

Data compiled by: John E. Bartmess
Individual Reactions
(CAS Reg. No. 42117-14-6 • 4294967295) +
= CAS Reg. No. 42117-14-6
By formula: (CAS Reg. No. 42117-14-6 • 4294967295C4H5N) + C4H5N = CAS Reg. No. 42117-14-6
Quantity | Value | Units | Method | Reference | Comment |
---|---|---|---|---|---|
ΔrH° | 50.7 ± 2.5 | kcal/mol | N/A | Bartmess, Scott, et al., 1979 | gas phase; value altered from reference due to change in acidity scale |

References

Bartmess, Scott, et al., 1979
Bartmess, J.E.; Scott, J.A.; McIver, R.T., Jr.,
The gas phase acidity scale from methanol to phenol,
J. Am. Chem. Soc., 1979, 101, 6047. [all data]