2-Bromo-1,1,1-trifluoroethane
- Formula: C2H2BrF3
- Molecular weight: 162.936
- IUPAC Standard InChIKey: TZNJHEHAYZJBHR-UHFFFAOYSA-N
- CAS Registry Number: 421-06-7
- Chemical structure:
View 3d structure (requires JavaScript / HTML 5) - Other names: 2,2,2-Trifluoroethyl bromide; β β β-Trifluoroethyl bromide; Ethane, 2-bromo-1,1,1-trifluoro-

Gas phase thermochemistry data

Data compiled by: Hussein Y. Afeefy, Joel F. Liebman, and Stephen E. Stein
Quantity | Value | Units | Method | Reference | Comment |
---|---|---|---|---|---|
ΔfH°gas | -695. ± 2. | kJ/mol | Eqk | Buckley, Ford, et al., 1980 | GLC;hf298_gas[kcal/mol]=-166.8±1.1; Kolesov and Papina, 1983 |

Phase change data

Data compiled as indicated in comments:
BS - Robert L. Brown and Stephen E. Stein
TRC - Thermodynamics Research Center, NIST Boulder Laboratories, Chris Muzny director
Quantity | Value | Units | Method | Reference | Comment |
---|---|---|---|---|---|
Tboil | 299. | K | N/A | PCR Inc., 1990 | BS |
Tboil | 299.2 | K | N/A | Weast and Grasselli, 1989 | BS |
Tboil | 248. | K | N/A | Davis and Larsen, 1967 | Uncertainty assigned by TRC = 3. K; TRC |

Reaction thermochemistry data

Data compiled by: Hussein Y. Afeefy, Joel F. Liebman, and Stephen E. Stein
Individual Reactions
By formula: C2H2BrF3 + I2 = C2H2F3I + BrI
Quantity | Value | Units | Method | Reference | Comment |
---|---|---|---|---|---|
ΔrH° | 28. ± 2. | kJ/mol | Eqk | Buckley, Ford, et al., 1980 | gas phase; GLC;hf298_gas[kcal/mol]=-166.8±1.1; Kolesov and Papina, 1983 |

References

Buckley, Ford, et al., 1980
Buckley, G.S.; Ford, W.G.F.; Rodgers, A.S.,
The thermochemistry of the gas phase reaction: CF3CH2Br + I2 = CF3CH2I + IBr. Polarity effects in thermochemistry,
Thermochim. Acta, 1980, 42, 349-355. [all data]
Kolesov and Papina, 1983
Kolesov, V.P.; Papina, T.S.,
Thermochemistry of Haloethanes,
Russ. Chem. Rev., 1983, 52, 425. [all data]
PCR Inc., 1990
PCR Inc.,
Research Chemicals Catalog 1990-1991, PCR Inc., Gainesville, FL, 1990, 1. [all data]
Weast and Grasselli, 1989
CRC Handbook of Data on Organic Compounds, 2nd Editon, Weast,R.C and Grasselli, J.G., ed(s)., CRC Press, Inc., Boca Raton, FL, 1989, 1. [all data]
Davis and Larsen, 1967
Davis, R.A.; Larsen, E.R.,
Chemistry of Boron Trifluoride. The Fluorination of Bromofluoroethanes,
J. Org. Chem., 1967, 32, 3478. [all data]