Acetonitrile, chlorodifluoro-
- Formula: C2ClF2N
- Molecular weight: 111.478
- IUPAC Standard InChIKey: GUIPZCNIFDPABQ-UHFFFAOYSA-N
- CAS Registry Number: 421-05-6
- Chemical structure:
View 3d structure (requires JavaScript / HTML 5) - Other names: Chlorodifluoroacetonitrile

Normal alkane RI, non-polar column, temperature ramp

Column type | Active phase | I | Reference | Comment |
---|---|---|---|---|
Capillary | OV-101 | 392. | Zenkevich, 2005 | 25. m/0.20 mm/0.10 μm, N2/He, 6. K/min; Tstart: 50. C; Tend: 250. C |

References

Zenkevich, 2005
Zenkevich, I.G.,
Experimentally measured retention indices., 2005. [all data]