D-gulose
- Formula: C6H12O6
- Molecular weight: 180.1559
- IUPAC Standard InChIKey: GZCGUPFRVQAUEE-JGWLITMVSA-N
- CAS Registry Number: 4205-23-6
- Chemical structure:
View 3d structure (requires JavaScript / HTML 5) - Stereoisomers:
- Comments:
- Although only a single structure is shown, this species may exist in several forms including a linear molecule, a five membered ring and a six membered ring.

Condensed phase thermochemistry data

Data compiled by: Hussein Y. Afeefy, Joel F. Liebman, and Stephen E. Stein
Quantity | Value | Units | Method | Reference | Comment |
---|---|---|---|---|---|
ΔcH°solid | -2817.3 | kJ/mol | Ccb | Emery and Benedict, 1911 | Corresponding ΔfHºsolid = -1258.7 kJ/mol (simple calculation by NIST; no Washburn corrections) |

References

Emery and Benedict, 1911
Emery, A.G.; Benedict, F.G.,
The heat of combustion of compounds of physiological importance,
Am. J. Physiol., 1911, 28, 301-307. [all data]