1-Bromo-1,1-difluoroethane
- Formula: C2H3BrF2
- Molecular weight: 144.946
- IUPAC Standard InChIKey: MGCGGCMKJWCMKL-UHFFFAOYSA-N
- CAS Registry Number: 420-47-3
- Chemical structure:
View 3d structure (requires JavaScript / HTML 5) - Permanent link for this species. Use this link for bookmarking this species for future reference.

Gas phase thermochemistry data

Data compiled by: Hussein Y. Afeefy, Joel F. Liebman, and Stephen E. Stein
Quantity | Value | Units | Method | Reference | Comment |
---|---|---|---|---|---|
ΔfH°gas | -474.3 ± 8.5 | kJ/mol | Kin | Pickard and Rodgers, 1977 | Reanalyzed by Kolesov and Papina, 1983, Original value = -477.8 ± 6.3 kJ/mol; Equilibration |

Reaction thermochemistry data

Data compiled by: Hussein Y. Afeefy, Joel F. Liebman, and Stephen E. Stein
Individual Reactions
By formula: C2H4F2 + I2 = HI + C2H3BrF2
Quantity | Value | Units | Method | Reference | Comment |
---|---|---|---|---|---|
ΔrH° | 51.0 ± 0.8 | kJ/mol | Eqk | Pickard and Rodgers, 1977, 2 | gas phase |

References

Pickard and Rodgers, 1977
Pickard, J.M.; Rodgers, A.S.,
The kinetics and equilibrium of the gas-phase reaction CH3CF2Br + I2 = IBr + CH3CF2I. The C-Br bond issociation energy in 1,1-difluorobromoethane,
Int. J. Chem. Kinet., 1977, 9, 759-767. [all data]
Kolesov and Papina, 1983
Kolesov, V.P.; Papina, T.S.,
Thermochemistry of Haloethanes,
Russ. Chem. Rev., 1983, 52, 425. [all data]
Pickard and Rodgers, 1977, 2
Pickard, J.M.; Rodgers, A.S.,
The kinetics and thermochemistry of the reaction of 1,1-difluoroethane with iodine. The difluoromethylene-hydrogen bond dissociation energy in 1,1-difluoroethane and the heat of formation of 1,1-difluoroethyl,
J. Am. Chem. Soc., 1977, 99, 691-694. [all data]