Trimethylaminetrifluoroborane
- Formula: C3H9BF3N
- Molecular weight: 126.916
- IUPAC Standard InChIKey: QZODDKPRVIPHHU-UHFFFAOYSA-N
- CAS Registry Number: 420-20-2
- Chemical structure:
View 3d structure (requires JavaScript / HTML 5) - Permanent link for this species. Use this link for bookmarking this species for future reference.

Phase change data

Data compiled by: William E. Acree, Jr., James S. Chickos
Enthalpy of sublimation
ΔsubH (kJ/mol) | Temperature (K) | Method | Reference | Comment |
---|---|---|---|---|
68.9 | 393. | A | Stephenson and Malanowski, 1987 | Based on data from 373. to 413. K. See also Burg and Green, 1943. |

Gas phase ion energetics data

Data compiled by: Sharon G. Lias, Rhoda D. Levin, and Sherif A. Kafafi
Ionization energy determinations
IE (eV) | Method | Reference | Comment |
---|---|---|---|
12.21 | PE | Lake, 1971 | Vertical value |

References

Stephenson and Malanowski, 1987
Stephenson, Richard M.; Malanowski, Stanislaw,
Handbook of the Thermodynamics of Organic Compounds, 1987, https://doi.org/10.1007/978-94-009-3173-2
. [all data]
Burg and Green, 1943
Burg, Sr.; Green, Agnes Ann,
Addition Compounds of Trimethylamine with Boron Fluoride and its Methyl Derivatives,
J. Am. Chem. Soc., 1943, 65, 10, 1838-1841, https://doi.org/10.1021/ja01250a014
. [all data]