Chloro(trifluoroacetyl)carbamic fluoride

Phase change data

Data compiled by: William E. Acree, Jr., James S. Chickos

Enthalpy of vaporization

ΔvapH (kJ/mol) Temperature (K) Reference
39.3371.Sprenger, Wright, et al., 1973

References

Sprenger, Wright, et al., 1973
Sprenger, George H.; Wright, Kenneth J.; Shreeve, Jean'ne M., Polar additions of chlorine monofluoride and chlorine fluorosulfate to fluorinated isocyanates, Inorg. Chem., 1973, 12, 12, 2890-2893, https://doi.org/10.1021/ic50130a029 . [all data]