Thiazole, 2,4-dimethyl-5-propyl-
- Formula: C8H13NS
- Molecular weight: 155.261
- IUPAC Standard InChIKey: BNONKJGVAXAEFW-UHFFFAOYSA-N
- CAS Registry Number: 41981-70-8
- Chemical structure:
View 3d structure (requires JavaScript / HTML 5) - Other names: 2,4-Dimethyl-5-propylthiazole

Kovats' RI, non-polar column, isothermal

Column type | Active phase | Temperature (C) | I | Reference | Comment |
---|---|---|---|---|---|
Capillary | OV-101 | 110. | 1157. | Golovnya, Shenderyuk, et al., 1991 | He; Column length: 50. m; Column diameter: 0.30 mm |
Capillary | OV-101 | 110. | 1157. | Zhuravleva, Shenderyuk, et al., 1990 | 50. m/0.30 mm/0.40 μm, He |
Packed | Apiezon L | 100. | 1153. | Yakush, Golovnya, et al., 1986 | Chromosorb GAW; Column length: 2.5 m |

Kovats' RI, polar column, isothermal

Column type | Active phase | Temperature (C) | I | Reference | Comment |
---|---|---|---|---|---|
Capillary | PEG-40M | 110. | 1515. | Golovnya, Shenderyuk, et al., 1991 | He; Column length: 50. m; Column diameter: 0.30 mm |
Capillary | PEG-40M | 110. | 1515. | Zhuravleva, Shenderyuk, et al., 1990 | 50. m/0.30 mm/0.40 μm, He |

References

Golovnya, Shenderyuk, et al., 1991
Golovnya, R.V.; Shenderyuk, V.V.; Zhuravleva, I.L.; Yakush, E.V.,
Analogy of sorption properties of alkylthiazoles and alkyl-oxazoles and its use for the calculation of retention indexes in capillary gas chromatography,
Zh. Anal. Khim., 1991, 46, 2, 313-319. [all data]
Zhuravleva, Shenderyuk, et al., 1990
Zhuravleva, I.L.; Shenderyuk, V.V.; Yakush, E.V.; Golovnya, R.V.,
Calculation of retention indexes of alkyloxazoles and alkylthiazoles in capillary chromatography,
Bull. Acad. Sci. USSR, Div. Chem. Sci. (Engl. Transl.), 1990, 6, 6, 1204-1210, https://doi.org/10.1007/BF00962384
. [all data]
Yakush, Golovnya, et al., 1986
Yakush, E.V.; Golovnya, R.V.; Zhuravleva, I.L.; Grigor'eva, D.N.,
Thermodynamic criterion and its use for identification of alkylthiazols from gas chromatographic data,
Zh. Anal. Khim., 1986, 41, 884-889. [all data]