Thiazole, 2-methyl-4-propyl-
- Formula: C7H11NS
- Molecular weight: 141.234
- IUPAC Standard InChIKey: KPTRSWJGYUCLLM-UHFFFAOYSA-N
- CAS Registry Number: 41981-63-9
- Chemical structure:
View 3d structure (requires JavaScript / HTML 5) - Other names: 2-Methyl-4-propylthiazole

Kovats' RI, non-polar column, isothermal

Column type | Active phase | Temperature (C) | I | Reference | Comment |
---|---|---|---|---|---|
Capillary | OV-101 | 110. | 1064. | Golovnya, Shenderyuk, et al., 1991 | He; Column length: 50. m; Column diameter: 0.30 mm |
Capillary | OV-101 | 110. | 1064. | Zhuravleva, Shenderyuk, et al., 1990 | 50. m/0.30 mm/0.40 μm, He |
Packed | Apiezon L | 100. | 1068. | Yakush, Golovnya, et al., 1986 | Chromosorb GAW; Column length: 2.5 m |

Kovats' RI, polar column, isothermal

Column type | Active phase | Temperature (C) | I | Reference | Comment |
---|---|---|---|---|---|
Capillary | PEG-40M | 110. | 1428. | Golovnya, Shenderyuk, et al., 1991 | He; Column length: 50. m; Column diameter: 0.30 mm |
Capillary | PEG-40M | 110. | 1428. | Zhuravleva, Shenderyuk, et al., 1990 | 50. m/0.30 mm/0.40 μm, He |

Normal alkane RI, non-polar column, temperature ramp

Column type | Active phase | I | Reference | Comment |
---|---|---|---|---|
Capillary | DB-1 | 1085. | Yu, Wu, et al., 1994 | 60. m/0.25 mm/1.0 μm, He, 40. C @ 5. min, 2. K/min, 260. C @ 60. min |

References

Golovnya, Shenderyuk, et al., 1991
Golovnya, R.V.; Shenderyuk, V.V.; Zhuravleva, I.L.; Yakush, E.V.,
Analogy of sorption properties of alkylthiazoles and alkyl-oxazoles and its use for the calculation of retention indexes in capillary gas chromatography,
Zh. Anal. Khim., 1991, 46, 2, 313-319. [all data]
Zhuravleva, Shenderyuk, et al., 1990
Zhuravleva, I.L.; Shenderyuk, V.V.; Yakush, E.V.; Golovnya, R.V.,
Calculation of retention indexes of alkyloxazoles and alkylthiazoles in capillary chromatography,
Bull. Acad. Sci. USSR, Div. Chem. Sci. (Engl. Transl.), 1990, 6, 6, 1204-1210, https://doi.org/10.1007/BF00962384
. [all data]
Yakush, Golovnya, et al., 1986
Yakush, E.V.; Golovnya, R.V.; Zhuravleva, I.L.; Grigor'eva, D.N.,
Thermodynamic criterion and its use for identification of alkylthiazols from gas chromatographic data,
Zh. Anal. Khim., 1986, 41, 884-889. [all data]
Yu, Wu, et al., 1994
Yu, T.-H.; Wu, C.-M.; Ho, C.-T.,
Meat-like flavor generated from thermal interactions of glucose and alliin or deoxyalliin,
J. Agric. Food Chem., 1994, 42, 4, 1005-1009, https://doi.org/10.1021/jf00040a032
. [all data]