Cyclopropane, 1-methyl-2-pentyl-
- Formula: C9H18
- Molecular weight: 126.2392
- IUPAC Standard InChIKey: SSVIRINIJMZEHE-UHFFFAOYSA-N
- CAS Registry Number: 41977-37-1
- Chemical structure:
View 3d structure (requires JavaScript / HTML 5) - Permanent link for this species. Use this link for bookmarking this species for future reference.

Normal alkane RI, non-polar column, custom temperature program

Column type | Active phase | I | Reference | Comment |
---|---|---|---|---|
Capillary | Squalane | 864. | Chen, 2008 | Program: not specified |

References

Chen, 2008
Chen, H.-F.,
Quantitative prediction of gas chromatography retention indices with support vector machines, radial basis neutral networks and multiple linear regression,
Anal. Chim. Acta, 2008, 609, 1, 24-36, https://doi.org/10.1016/j.aca.2008.01.003
. [all data]