CAS Reg. No. 41976-93-6
- CAS Registry Number: 41976-93-6

Reaction thermochemistry data

Data compiled by: John E. Bartmess
Individual Reactions
(CAS Reg. No. 41976-93-6 • 4294967295) +
= CAS Reg. No. 41976-93-6
By formula: (CAS Reg. No. 41976-93-6 • 4294967295CO) + CO = CAS Reg. No. 41976-93-6
Quantity | Value | Units | Method | Reference | Comment |
---|---|---|---|---|---|
ΔrH° | >5.00 | kcal/mol | Ther | Karpas and Klein, 1976 | gas phase; From Cl2CO |

References

Karpas and Klein, 1976
Karpas, Z.; Klein, F.S.,
ICR study of the gas phase ion chemistry of the carbonyl halides: Cl2CO, F2CO and ClFCO,
Int. J. Mass Spectrom. Ion Phys., 1976, 22, 189. [all data]