2-Decen-1-ol, (Z)-
- Formula: C10H20O
- Molecular weight: 156.2652
- IUPAC Standard InChIKey: QOPYYRPCXHTOQZ-HJWRWDBZSA-N
- CAS Registry Number: 4194-71-2
- Chemical structure:
View 3d structure (requires JavaScript / HTML 5) - Stereoisomers:
- Other names: cis-2-Decen-1-ol; (Z)-2-Decen-1-ol

Kovats' RI, non-polar column, isothermal

Column type | Active phase | Temperature (C) | I | Reference | Comment |
---|---|---|---|---|---|
Packed | Apiezon L | 130. | 1221. | Nedopekina, Kovalev, et al., 1981 | N2, Chromatron N-AW-HMDS; Column length: 2.5 m |

Kovats' RI, non-polar column, temperature ramp

Column type | Active phase | I | Reference | Comment |
---|---|---|---|---|
Capillary | OV-101 | 1251. | Tamura, Kihara, et al., 1991 | N2, 2. K/min; Column length: 50. m; Column diameter: 0.25 mm; Tstart: 80. C; Tend: 200. C |

Kovats' RI, polar column, temperature ramp

Column type | Active phase | I | Reference | Comment |
---|---|---|---|---|
Capillary | Carbowax 20M | 1819. | Tamura, Kihara, et al., 1991 | 2. K/min; Column length: 50. m; Column diameter: 0.25 mm; Tstart: 80. C; Tend: 180. C |

Normal alkane RI, non-polar column, temperature ramp

Column type | Active phase | I | Reference | Comment |
---|---|---|---|---|
Capillary | OV-101 | 1251. | Tamura, Kihara, et al., 1990 | Nitrogen, 2. K/min; Column length: 50. m; Column diameter: 0.25 mm; Tstart: 80. C; Tend: 200. C |
Capillary | OV-101 | 1257. | Tamura, Kihara, et al., 1990 | Nitrogen, 2. K/min; Column length: 50. m; Column diameter: 0.25 mm; Tstart: 80. C; Tend: 200. C |

Normal alkane RI, non-polar column, custom temperature program

Column type | Active phase | I | Reference | Comment |
---|---|---|---|---|
Capillary | SE-30 | 1257. | Vinogradov, 2004 | Program: not specified |

Normal alkane RI, polar column, temperature ramp

Column type | Active phase | I | Reference | Comment |
---|---|---|---|---|
Capillary | Carbowax 20M | 1819. | Tamura, Kihara, et al., 1990 | Nitrogen, 2. K/min; Column length: 50. m; Column diameter: 0.25 mm; Tstart: 80. C; Tend: 180. C |
Capillary | Carbowax 20M | 1819. | Tamura, Kihara, et al., 1990 | Nitrogen, 2. K/min; Column length: 50. m; Column diameter: 0.25 mm; Tstart: 80. C; Tend: 180. C |

Normal alkane RI, polar column, custom temperature program

Column type | Active phase | I | Reference | Comment |
---|---|---|---|---|
Capillary | Carbowax 20M | 1794. | Vinogradov, 2004 | Program: not specified |

References

Nedopekina, Kovalev, et al., 1981
Nedopekina, S.F.; Kovalev, B.G.; Kost, A.N.,
Use of Kovats indices for idetifying sex pheromones,
Chem. Nat. Compd. (Engl. Transl.), 1981, 17, 4, 376-380, https://doi.org/10.1007/BF01185272
. [all data]
Tamura, Kihara, et al., 1991
Tamura, H.; Kihara, S.; Nakahara, K.; Sugisawa, H.,
A program for predicting aliphatic compounds using linear equations of GC retention index value,
Nippon Shokuhin Kogyo Gakkaishi, 1991, 38, 10, 934-939, https://doi.org/10.3136/nskkk1962.38.934
. [all data]
Tamura, Kihara, et al., 1990
Tamura, H.; Kihara, S.; Sugisawa, H.,
A New Identification Method for Aliphatic Compounds Using Linear Equation of the GC Retention Index Value,
Agric. Biol. Chem., 1990, 54, 12, 3171-3176, https://doi.org/10.1271/bbb1961.54.3171
. [all data]
Vinogradov, 2004
Vinogradov, B.A.,
Production, composition, properties and application of essential oils, 2004, retrieved from http://viness.narod.ru. [all data]