cis-1-Propenyl tert-butyl ether
- Formula: C7H14O
- Molecular weight: 114.1855
- IUPAC Standard InChIKey: XGCRQUBGQPXCPL-WAYWQWQTSA-N
- CAS Registry Number: 4188-71-0
- Chemical structure:
View 3d structure (requires JavaScript / HTML 5) - Stereoisomers:

Reaction thermochemistry data

Data compiled by: Hussein Y. Afeefy, Joel F. Liebman, and Stephen E. Stein
Individual Reactions
By formula: C7H14O = C7H14O
Quantity | Value | Units | Method | Reference | Comment |
---|---|---|---|---|---|
ΔrH° | -6.07 ± 0.29 | kcal/mol | Eqk | Taskinen, 1993 | liquid phase; solvent: DMSO; Isomerization |
By formula: C7H14O = C7H14O
Quantity | Value | Units | Method | Reference | Comment |
---|---|---|---|---|---|
ΔrH° | 0.68 ± 0.14 | kcal/mol | Eqk | Okuyama, Fueno, et al., 1969 | liquid phase; GC |

References

Taskinen, 1993
Taskinen, E.,
Relative thermodynamic stabilities of isomeric alkyl allyl and alkyl (Z)-propenyl ethers,
Tetrahedron, 1993, 49, 11389-11394. [all data]
Okuyama, Fueno, et al., 1969
Okuyama, T.; Fueno, T.; Furukawa, J.,
Structure and reactivity of α,β-unsaturated ethers. 9. Cis-trans isomerization equilibriums in the liquid phase,
Tetrahedron, 1969, 25, 5409-5414. [all data]