trans-1-Propenyl methyl ether
- Formula: C4H8O
- Molecular weight: 72.1057
- IUPAC Standard InChIKey: QHMVQKOXILNZQR-ONEGZZNKSA-N
- CAS Registry Number: 4188-69-6
- Chemical structure:
View 3d structure (requires JavaScript / HTML 5) - Other names: 1-Propene, 1-methoxy-, (E)-; (E)-CH3OCH=CHCH3; 1-Propene, 1-methoxy-, (1E)-; trans methyl propenyl ether

Phase change data

Data compiled by: William E. Acree, Jr., James S. Chickos
Enthalpy of vaporization
ΔvapH (kJ/mol) | Temperature (K) | Method | Reference | Comment |
---|---|---|---|---|
29.5 | 307. | A | Stephenson and Malanowski, 1987 | Based on data from 293. to 322. K. |

Reaction thermochemistry data

Data compiled by: Hussein Y. Afeefy, Joel F. Liebman, and Stephen E. Stein
Individual Reactions
By formula: C4H8O = C4H8O
Quantity | Value | Units | Method | Reference | Comment |
---|---|---|---|---|---|
ΔrH° | -3.82 ± 0.24 | kJ/mol | Eqk | Okuyama, Fueno, et al., 1969 | liquid phase; Gc |

References

Stephenson and Malanowski, 1987
Stephenson, Richard M.; Malanowski, Stanislaw,
Handbook of the Thermodynamics of Organic Compounds, 1987, https://doi.org/10.1007/978-94-009-3173-2
. [all data]
Okuyama, Fueno, et al., 1969
Okuyama, T.; Fueno, T.; Furukawa, J.,
Structure and reactivity of α,β-unsaturated ethers. 9. Cis-trans isomerization equilibriums in the liquid phase,
Tetrahedron, 1969, 25, 5409-5414. [all data]