1-Propene, 1-(1-methylethoxy)-, (Z)-
- Formula: C6H12O
- Molecular weight: 100.1589
- IUPAC Standard InChIKey: PLGKZYGGZOMZHL-PLNGDYQASA-N
- CAS Registry Number: 4188-64-1
- Chemical structure:
View 3d structure (requires JavaScript / HTML 5) - Stereoisomers:
- Other names: cis-1-Propenyl isopropyl ether

Reaction thermochemistry data

Data compiled by: Hussein Y. Afeefy, Joel F. Liebman, and Stephen E. Stein
Individual Reactions
By formula: C6H12O = C6H12O
Quantity | Value | Units | Method | Reference | Comment |
---|---|---|---|---|---|
ΔrH° | -5.6 ± 0.1 | kcal/mol | Eqk | Taskinen, 1993 | liquid phase; solvent: DMSO; Isomerization |
By formula: C6H12O = C6H12O
Quantity | Value | Units | Method | Reference | Comment |
---|---|---|---|---|---|
ΔrH° | 0.568 ± 0.047 | kcal/mol | Eqk | Okuyama, Fueno, et al., 1969 | liquid phase; GC |

References

Taskinen, 1993
Taskinen, E.,
Relative thermodynamic stabilities of isomeric alkyl allyl and alkyl (Z)-propenyl ethers,
Tetrahedron, 1993, 49, 11389-11394. [all data]
Okuyama, Fueno, et al., 1969
Okuyama, T.; Fueno, T.; Furukawa, J.,
Structure and reactivity of α,β-unsaturated ethers. 9. Cis-trans isomerization equilibriums in the liquid phase,
Tetrahedron, 1969, 25, 5409-5414. [all data]