Cyclohexane, 1,1'-(1-methyl-1,2-ethanediyl)bis-
- Formula: C15H28
- Molecular weight: 208.3828
- IUPAC Standard InChIKey: CTAURVAUCOLBHF-UHFFFAOYSA-N
- CAS Registry Number: 41851-34-7
- Chemical structure:
View 3d structure (requires JavaScript / HTML 5) - Other names: 1,2-Dicyclohexylpropane

Condensed phase thermochemistry data

Data compiled by: Eugene S. Domalski and Elizabeth D. Hearing
Constant pressure heat capacity of liquid
Cp,liquid (J/mol*K) | Temperature (K) | Reference | Comment |
---|---|---|---|
398.3 | 313. | Gudinowicz, Campbell, et al., 1963 | T = 313 to 583 K. |
497.9 | 422. | Gollis, Belenyessy, et al., 1962 |

References

Gudinowicz, Campbell, et al., 1963
Gudinowicz, B.J.; Campbell, R.H.; Adams, J.S.,
Specific heat measurements of complex saturated hydrocarbons,
J. Chem. Eng. Data, 1963, 8, 201-214. [all data]
Gollis, Belenyessy, et al., 1962
Gollis, M.H.; Belenyessy, L.I.; Gudzinowicz, B.J.; Koch, S.D.; Smith, J.O.; Wineman, R.J.,
Evaluations of pure hydrocarbons as Jet Fuels,
J. Chem. Eng. Data, 1962, 7, 311-316. [all data]