1,1-Dimethyl-2-hexylcyclopropane
- Formula: C11H22
- Molecular weight: 154.2924
- IUPAC Standard InChIKey: UQECZADINQGSLE-UHFFFAOYSA-N
- CAS Registry Number: 41845-49-2
- Chemical structure:
View 3d structure (requires JavaScript / HTML 5) - Permanent link for this species. Use this link for bookmarking this species for future reference.

Condensed phase thermochemistry data

Data compiled by: Hussein Y. Afeefy, Joel F. Liebman, and Stephen E. Stein
Quantity | Value | Units | Method | Reference | Comment |
---|---|---|---|---|---|
ΔfH°liquid | -193. | kJ/mol | Ccb | Kachinskaya, Togoeva, et al., 1960 | |
Quantity | Value | Units | Method | Reference | Comment |
ΔcH°liquid | -7280. ± 2. | kJ/mol | Ccb | Kachinskaya, Togoeva, et al., 1960 | Corresponding ΔfHºliquid = -193. kJ/mol (simple calculation by NIST; no Washburn corrections) |

References

Kachinskaya, Togoeva, et al., 1960
Kachinskaya, O.N.; Togoeva, S.Kh.; Meshcheryakov, A.P.; Skuratov, S.M.,
Heats of combustion of 1,1,-dimethyl-2-alkylcyclopropanes,
Dokl. Akad. Nauk SSSR, 1960, 132, 119-122. [all data]