1,1-Dimethyl-2-propyl-cyclopropane
- Formula: C8H16
- Molecular weight: 112.2126
- IUPAC Standard InChIKey: NWQWWOHNBLAJQT-UHFFFAOYSA-N
- CAS Registry Number: 41845-48-1
- Chemical structure:
View 3d structure (requires JavaScript / HTML 5) - Permanent link for this species. Use this link for bookmarking this species for future reference.

Condensed phase thermochemistry data

Data compiled by: Hussein Y. Afeefy, Joel F. Liebman, and Stephen E. Stein
Quantity | Value | Units | Method | Reference | Comment |
---|---|---|---|---|---|
ΔfH°liquid | -27.82 | kcal/mol | Ccb | Kachinskaya, Togoeva, et al., 1960 | |
Quantity | Value | Units | Method | Reference | Comment |
ΔcH°liquid | -1271.2 ± 0.4 | kcal/mol | Ccb | Kachinskaya, Togoeva, et al., 1960 | Corresponding ΔfHºliquid = -27.7 kcal/mol (simple calculation by NIST; no Washburn corrections) |

Kovats' RI, non-polar column, isothermal

Column type | Active phase | Temperature (C) | I | Reference | Comment |
---|---|---|---|---|---|
Capillary | Squalane | 60. | 727.4 | Schomburg and Dielmann, 1973 | Column length: 100. m; Column diameter: 0.25 mm |

References

Kachinskaya, Togoeva, et al., 1960
Kachinskaya, O.N.; Togoeva, S.Kh.; Meshcheryakov, A.P.; Skuratov, S.M.,
Heats of combustion of 1,1,-dimethyl-2-alkylcyclopropanes,
Dokl. Akad. Nauk SSSR, 1960, 132, 119-122. [all data]