1,1-Dimethyl-2-ethyl-cyclopropane
- Formula: C7H14
- Molecular weight: 98.1861
- IUPAC Standard InChIKey: UDCRTPSZNQOKRO-UHFFFAOYSA-N
- CAS Registry Number: 41845-47-0
- Chemical structure:
View 3d structure (requires JavaScript / HTML 5) - Permanent link for this species. Use this link for bookmarking this species for future reference.

Kovats' RI, non-polar column, isothermal

Column type | Active phase | Temperature (C) | I | Reference | Comment |
---|---|---|---|---|---|
Capillary | Squalane | 60. | 632.8 | Schomburg and Dielmann, 1973 | Column length: 100. m; Column diameter: 0.25 mm |

References

Schomburg and Dielmann, 1973
Schomburg, G.; Dielmann, G.,
Use of retention increments for identification and correlation of saturated and unsaturated cyclopropane hydrocarbons by means of Kovats indices,
Anal. Chem., 1973, 45, 9, 1647-1658, https://doi.org/10.1021/ac60331a021
. [all data]