1-Isopropyl-4-methyl-7-oxa-bicyclo[4.1.0]heptane
- Formula: C10H18O
- Molecular weight: 154.2493
- IUPAC Standard InChIKey: PPERHRAPFJGBED-UHFFFAOYSA-N
- CAS Registry Number: 4184-02-5
- Chemical structure:
View 3d structure (requires JavaScript / HTML 5) - Species with the same structure:

Condensed phase thermochemistry data

Data compiled by: Hussein Y. Afeefy, Joel F. Liebman, and Stephen E. Stein
Quantity | Value | Units | Method | Reference | Comment |
---|---|---|---|---|---|
ΔcH°liquid | -5450.9 | kJ/mol | Ccb | Tanaka, 1939 | Corresponding ΔfHºliquid = -1056. kJ/mol (simple calculation by NIST; no Washburn corrections) |

References

Tanaka, 1939
Tanaka, S.,
On the addition of oxygen to the double bonds,
Mem. Coll. Sci. Univ. Kyoto, Ser. A, 1939, 22, 97-126. [all data]