Tetracontane
- Formula: C40H82
- Molecular weight: 563.0791
- IUPAC Standard InChIKey: KUPLEGDPSCCPJI-UHFFFAOYSA-N
- CAS Registry Number: 4181-95-7
- Chemical structure:
View 3d structure (requires JavaScript / HTML 5) - Other names: n-Tetracontane

Phase change data

Data compiled as indicated in comments:
TRC - Thermodynamics Research Center, NIST Boulder Laboratories, Chris Muzny director
AC - William E. Acree, Jr., James S. Chickos
CAL - James S. Chickos, William E. Acree, Jr., Joel F. Liebman, Students of Chem 202 (Introduction to the Literature of Chemistry), University of Missouri -- St. Louis
Quantity | Value | Units | Method | Reference | Comment |
---|---|---|---|---|---|
Tfus | 354.1 ± 0.8 | K | AVG | N/A | Average of 7 values; Individual data points |
Quantity | Value | Units | Method | Reference | Comment |
ΔvapH° | 203.5 ± 0.2 | kJ/mol | CGC | Chickos, Wang, et al., 2008 | Based on data from 323. to 523. K.; AC |
Enthalpy of vaporization
ΔvapH (kJ/mol) | Temperature (K) | Method | Reference | Comment |
---|---|---|---|---|
132.2 | 572. | A,E | Stephenson and Malanowski, 1987 | Based on data from 557. to 798. K. See also Kudchadker and Zwolinski, 1966.; AC |
Enthalpy of fusion
ΔfusH (kJ/mol) | Temperature (K) | Method | Reference | Comment |
---|---|---|---|---|
143.94 | 354.6 | DSC | Wang, Tozaki, et al., 2006 | AC |
133.44 | 353.2 | DSC | Lourdin, Roux, et al., 1992 | AC |
Entropy of fusion
ΔfusS (J/mol*K) | Temperature (K) | Reference | Comment |
---|---|---|---|
40.58 | 345.4 | Lourdin, Roux, et al., 1992, 2 | CAL |
377.82 | 353.2 |

References

Chickos, Wang, et al., 2008
Chickos, James; Wang, Tracy; Sharma, Esseim,
Hypothetical Thermodynamic Properties: Vapor Pressures and Vaporization Enthalpies of the Even n -Alkanes from C 40 to C 76 at T = 298.15 K by Correlation-Gas Chromatography. Are the Vaporization Enthalpies a Linear Function of Carbon Number?,
J. Chem. Eng. Data, 2008, 53, 2, 481-491, https://doi.org/10.1021/je7005852
. [all data]
Stephenson and Malanowski, 1987
Stephenson, Richard M.; Malanowski, Stanislaw,
Handbook of the Thermodynamics of Organic Compounds, 1987, https://doi.org/10.1007/978-94-009-3173-2
. [all data]
Kudchadker and Zwolinski, 1966
Kudchadker, A.P.; Zwolinski, B.J.,
Vapor Pressure and Boiling Points of Normal Alkanes, C 21 to C 100 .,
J. Chem. Eng. Data, 1966, 11, 2, 253-255, https://doi.org/10.1021/je60029a039
. [all data]
Wang, Tozaki, et al., 2006
Wang, Shaolan; Tozaki, Ken-Ichi; Hayashi, Hideko; Inaba, Hideaki; Yamamoto, Hiroko,
Observation of multiple phase transitions in some even n-alkanes using a high resolution and super-sensitive DSC,
Thermochimica Acta, 2006, 448, 2, 73-81, https://doi.org/10.1016/j.tca.2006.06.022
. [all data]
Lourdin, Roux, et al., 1992
Lourdin, D.; Roux, A.H.; Grolier, J.-P.E.; Buisine, J.-M.,
Thermobarometric and differential scanning calorimetric study of the polymorphism of some even and odd paraffins (C26, C27, C40, C60),
Thermochimica Acta, 1992, 204, 1, 99-110, https://doi.org/10.1016/0040-6031(92)80319-R
. [all data]
Lourdin, Roux, et al., 1992, 2
Lourdin, D.; Roux, A.H.; Grolier, J.-P.E.; Buisine, J.-M.,
Thermobarometric and differential scanning calorimetric study of the polymorphism of some even and odd paraffins (C26, C27, C40, C60),
Thermochim. Acta, 1992, 204, 1, 99, https://doi.org/10.1016/0040-6031(92)80319-R
. [all data]